BDBM162039 US9669028, 42 5-(6-chloropyrazin-2-yl)-3-methyl-1H-pyrazolo[3,4-b]pyridine
SMILES Cc1n[nH]c2ncc(cc12)-c1cncc(Cl)n1
InChI Key InChIKey=BTHPZWRNTLLZIF-UHFFFAOYSA-N
Data  2 IC50
  Tab Delimited (TSV)   2D SDfile   Computed 3D by Vconf -m prep SDfile
Find this compound or compounds like it in BindingDB:
Activity Spreadsheet -- Enzyme Inhibition Constant Data from BindingDB
Found 2 hits for monomerid = 162039
TargetLeucine-rich repeat serine/threonine-protein kinase 2 [G2019S](Homo sapiens (Human))
Arrien Pharmaceuticals
US Patent
LigandPNGBDBM162039(US9669028, 42 5-(6-chloropyrazin-2-yl)-3-methyl-1H...)
Affinity DataIC50: >1.00E+3nM. Assay description: Procedure: Enzyme was incubated with substrate peptide in reaction buffer in the presence and absence of test compounds or Staurosporine. All additio...
Ligand InfoPC cidPC sid
In DepthDetails US Patent
TargetLeucine-rich repeat serine/threonine-protein kinase 2(Homo sapiens (Human))
Arrien Pharmaceuticals
US Patent
LigandPNGBDBM162039(US9669028, 42 5-(6-chloropyrazin-2-yl)-3-methyl-1H...)
Affinity DataIC50: >1.00E+3nM. Assay description: Procedure: Enzyme was incubated with substrate peptide in reaction buffer in the presence and absence of test compounds or Staurosporine. All additio...
Ligand InfoPC cidPC sid
In DepthDetails US Patent