BDBM162067 US9682993, Table III
SMILES C[C@H](OC(=O)N(C)C(C)(C)C)\C=C/C(=O)N[C@H]1CO[C@@H](C\C=C(/C)\C=C\[C@@H]2C[C@]3(CO3)CC(C)(C)O2)OC1
InChI Key InChIKey=MSBXZHDPQZMJMG-NJWWTUQPSA-N
Data  2 IC50
  Tab Delimited (TSV)   2D SDfile   Computed 3D by Vconf -m prep SDfile
Find this compound or compounds like it in BindingDB:
Activity Spreadsheet -- Enzyme Inhibition Constant Data from BindingDB
Found 2 hits for monomerid = 162067
TargetE3 ubiquitin-protein ligase Mdm2(Homo sapiens (Human))
St. Jude Children'S Research Hospital
US Patent
LigandPNGBDBM162067(US9682993, Table III)
Affinity DataIC50:  2.70E+3nM. Assay description: JeKo1 cell lines were seeded in 100 μL cell culture medium in 96-well plates. Depending on the cell proliferation rate, cells were seeded at 4,0...
Ligand InfoPC cidPC sid
In DepthDetails US Patent
TargetE3 ubiquitin-protein ligase Mdm2(Homo sapiens (Human))
St. Jude Children'S Research Hospital
US Patent
LigandPNGBDBM162067(US9682993, Table III)
Affinity DataIC50:  2.70E+3nM. Assay description: PC3 cell lines were seeded in 100 μL cell culture medium in 96-well plates. Depending on the cell proliferation rate, cells were seeded at 4,000...
Ligand InfoPC cidPC sid
In DepthDetails US Patent