BDBM16216 2-phenyl-2-[4-(1H-pyrazol-4-yl)phenyl]ethan-1-amine::2-phenyl-2-[4-(1H-pyrazol-4-yl)phenyl]ethanamine::pyrazole-based inhibitor 6
SMILES NCC(c1ccccc1)c1ccc(cc1)-c1cn[nH]c1
InChI Key InChIKey=MWSMBSLUKDQMPK-UHFFFAOYSA-N
Data  1 IC50
  Tab Delimited (TSV)   2D SDfile   Computed 3D by Vconf -m prep SDfile
Find this compound or compounds like it in BindingDB:
Activity Spreadsheet -- Enzyme Inhibition Constant Data from BindingDB
Found 1 hit for monomerid = 16216
TargetRAC-beta serine/threonine-protein kinase(Homo sapiens (Human))
Astex
LigandPNGBDBM16216(2-phenyl-2-[4-(1H-pyrazol-4-yl)phenyl]ethan-1-amin...)
Affinity DataIC50:  510nMpH: 7.2 T: 2°C. Assay description: The purified PKB beta enzyme was assayed with a peptide substrate and test compound in the presence of 30 uM ATP/ [gamma-33P]ATP in 96-well plates. I...
In DepthDetails ArticlePubMed