BDBM162207 US9682995, 105
SMILES CN(C)c1cncc(Nc2snc(C)c2C(=O)Nc2ccc(F)c(F)c2)n1
InChI Key InChIKey=FLGZOHXAWGBLSS-UHFFFAOYSA-N
Data  3 IC50
  Tab Delimited (TSV)   2D SDfile   Computed 3D by Vconf -m prep SDfile
Find this compound or compounds like it in BindingDB:
Activity Spreadsheet -- Enzyme Inhibition Constant Data from BindingDB
Found 3 hits for monomerid = 162207
TargetCyclin-dependent kinase 2/G1/S-specific cyclin-E1(Homo sapiens (Human))
Bayer Pharma Aktiengesellschaft
US Patent
LigandPNGBDBM162207(US9682995, 105)
Affinity DataIC50: >2.00E+4nMpH: 7.5 T: 2°C. Assay description: N-terminally His6-tagged recombinant catalytic domain of human Bub1 (amino acids 704-1085), expressed in insect cells (Hi5) and purified by Ni-NTA af...
Ligand InfoPC cidPC sid
In DepthDetails US Patent
TargetDual specificity protein kinase TTK(Homo sapiens (Human))
Bayer Pharma Aktiengesellschaft
US Patent
LigandPNGBDBM162207(US9682995, 105)
Affinity DataIC50:  1.20E+4nMpH: 7.7 T: 2°C. Assay description: N-terminally GST-tagged human full length recombinant Mps-1 kinase (purchased from Invitrogen, Karslruhe, Germany, cat. no PV4071) was used. As subst...
Ligand InfoPC cidPC sid
In DepthDetails US Patent
TargetMitotic checkpoint serine/threonine-protein kinase BUB1 [704-1085](Homo sapiens (Human))
Bayer Pharma Aktiengesellschaft
US Patent
LigandPNGBDBM162207(US9682995, 105)
Affinity DataIC50: >2.00E+4nMpH: 8.0Assay Description:Recombinant fusion proteins of GST and human CDK2 and of GST and human CycE, expressed in insect cells (Sf9) and purified by Glutathion-Sepharose aff...
Ligand InfoPC cidPC sid
In DepthDetails US Patent