BDBM162348 US9669028, 127 N1-(6-(1H-pyrrolo[2,3-b]pyridin-5-yl)pyrazin-2-yl)-N2,N2-dimethylethane-1,2-diamine
SMILES CN(C)CCNc1cncc(n1)-c1cnc2[nH]ccc2c1
InChI Key InChIKey=KGQGVDVWDPFYFE-UHFFFAOYSA-N
Data  3 IC50
  Tab Delimited (TSV)   2D SDfile   Computed 3D by Vconf -m prep SDfile
Find this compound or compounds like it in BindingDB:
Activity Spreadsheet -- Enzyme Inhibition Constant Data from BindingDB
Found 3 hits for monomerid = 162348
TargetLeucine-rich repeat serine/threonine-protein kinase 2(Homo sapiens (Human))
Arrien Pharmaceuticals
US Patent
LigandPNGBDBM162348(US9669028, 127 N1-(6-(1H-pyrrolo[2,3-b]pyridin-5-y...)
Affinity DataIC50: >500nM. Assay description: Procedure: Enzyme was incubated with substrate peptide in reaction buffer in the presence and absence of test compounds or Staurosporine. All additio...
Ligand InfoPC cidPC sid
In DepthDetails US Patent
TargetDual specificity tyrosine-phosphorylation-regulated kinase 1A(Homo sapiens (Human))
Arrien Pharmaceuticals
US Patent
LigandPNGBDBM162348(US9669028, 127 N1-(6-(1H-pyrrolo[2,3-b]pyridin-5-y...)
Affinity DataIC50: >500nMpH: 7.5Assay Description:The 2×DYRK1A/Ser/Thr 18 mixture was prepared in 50 mM HEPES pH 7.5, 0.01% BRIJ-35, 10 mM MgCl2, 1 mM EGTA. The final 10 μL Kinase Reaction consi...
Ligand InfoPC cidPC sid
In DepthDetails US Patent
TargetLeucine-rich repeat serine/threonine-protein kinase 2 [G2019S](Homo sapiens (Human))
Arrien Pharmaceuticals
US Patent
LigandPNGBDBM162348(US9669028, 127 N1-(6-(1H-pyrrolo[2,3-b]pyridin-5-y...)
Affinity DataIC50: >500nM. Assay description: Procedure: Enzyme was incubated with substrate peptide in reaction buffer in the presence and absence of test compounds or Staurosporine. All additio...
Ligand InfoPC cidPC sid
In DepthDetails US Patent