BDBM162405 US9056832, 24::US9611222, Example 24
SMILES OC[C@@H](O)c1cccc(n1)-c1ccc(Oc2ccc(cn2)C(F)(F)F)cc1
InChI Key InChIKey=ROYRLDPHNBXWCX-QGZVFWFLSA-N
Data  2 IC50
  Tab Delimited (TSV)   2D SDfile   Computed 3D by Vconf -m prep SDfile
Find this compound or compounds like it in BindingDB:
Activity Spreadsheet -- Enzyme Inhibition Constant Data from BindingDB
Found 2 hits for monomerid = 162405
TargetSodium channel protein type 9 subunit alpha(Homo sapiens (Human))
Purdue Pharma
US Patent
LigandPNGBDBM162405(US9056832, 24 | US9611222, Example 24)
Affinity DataIC50:  6.49E+3nM. Assay description: In vitro assays were performed in a recombinant cell line expressing cDNA encoding the alpha subunit (Nav1.7, SCN9a, PN1, NE) of human Nav1.7 (Access...
In DepthDetails US Patent
TargetSodium channel protein type 9 subunit alpha(Homo sapiens (Human))
Purdue Pharma
US Patent
LigandPNGBDBM162405(US9056832, 24 | US9611222, Example 24)
Affinity DataIC50:  6.49E+3nM. Assay description: Recombinant Nav1.7 Cell Line: In vitro assays were performed in a recombinant cell line expressing cDNA encoding the alpha subunit (Nav1.7, SCN9a, PN...
In DepthDetails US Patent