BDBM162431 US9056832, 50::US9611222, Example 50
SMILES CS(=O)(=O)NCc1cc(nc(c1)-c1ccc(Oc2ccc(F)cc2)cc1)C(N)=O
InChI Key InChIKey=SBCWNDSDSOCXBS-UHFFFAOYSA-N
Data  2 IC50
  Tab Delimited (TSV)   2D SDfile   Computed 3D by Vconf -m prep SDfile
Find this compound or compounds like it in BindingDB:
Activity Spreadsheet -- Enzyme Inhibition Constant Data from BindingDB
Found 2 hits for monomerid = 162431
TargetSodium channel protein type 9 subunit alpha(Homo sapiens (Human))
Purdue Pharma
US Patent
LigandPNGBDBM162431(US9056832, 50 | US9611222, Example 50)
Affinity DataIC50:  140nM. Assay description: In vitro assays were performed in a recombinant cell line expressing cDNA encoding the alpha subunit (Nav1.7, SCN9a, PN1, NE) of human Nav1.7 (Access...
Ligand InfoPC cidPC sid
In DepthDetails US Patent
TargetSodium channel protein type 9 subunit alpha(Homo sapiens (Human))
Purdue Pharma
US Patent
LigandPNGBDBM162431(US9056832, 50 | US9611222, Example 50)
Affinity DataIC50:  140nM. Assay description: Recombinant Nav1.7 Cell Line: In vitro assays were performed in a recombinant cell line expressing cDNA encoding the alpha subunit (Nav1.7, SCN9a, PN...
Ligand InfoPC cidPC sid
In DepthDetails US Patent