BDBM162457 US9056832, 76::US9611222, Example 76
SMILES NC(=O)N1CCN(CC1)c1cc(nc(c1)-c1ccc(Oc2ccc(F)cc2)cc1)C(N)=O
InChI Key InChIKey=ZLIVQXBWKHHDTN-UHFFFAOYSA-N
Data  2 IC50
  Tab Delimited (TSV)   2D SDfile   Computed 3D by Vconf -m prep SDfile
Find this compound or compounds like it in BindingDB:
Activity Spreadsheet -- Enzyme Inhibition Constant Data from BindingDB
Found 2 hits for monomerid = 162457
TargetSodium channel protein type 9 subunit alpha(Homo sapiens (Human))
Purdue Pharma
US Patent
LigandPNGBDBM162457(US9056832, 76 | US9611222, Example 76)
Affinity DataIC50:  530nM. Assay description: In vitro assays were performed in a recombinant cell line expressing cDNA encoding the alpha subunit (Nav1.7, SCN9a, PN1, NE) of human Nav1.7 (Access...
In DepthDetails US Patent
TargetSodium channel protein type 9 subunit alpha(Homo sapiens (Human))
Purdue Pharma
US Patent
LigandPNGBDBM162457(US9056832, 76 | US9611222, Example 76)
Affinity DataIC50:  530nM. Assay description: Recombinant Nav1.7 Cell Line: In vitro assays were performed in a recombinant cell line expressing cDNA encoding the alpha subunit (Nav1.7, SCN9a, PN...
In DepthDetails US Patent