BDBM162459 US9056832, 78::US9611222, Example 78
SMILES Fc1ccc(Oc2ccc(cc2)-c2cc(cc(n2)C(=O)N2CCNCC2)N2CCNCC2)cc1
InChI Key InChIKey=RJDVJGQUZZTXDM-UHFFFAOYSA-N
Data  2 IC50
  Tab Delimited (TSV)   2D SDfile   Computed 3D by Vconf -m prep SDfile
Find this compound or compounds like it in BindingDB:
Activity Spreadsheet -- Enzyme Inhibition Constant Data from BindingDB
Found 2 hits for monomerid = 162459
TargetSodium channel protein type 9 subunit alpha(Homo sapiens (Human))
Purdue Pharma
US Patent
LigandPNGBDBM162459(US9056832, 78 | US9611222, Example 78)
Affinity DataIC50:  1.50E+4nM. Assay description: In vitro assays were performed in a recombinant cell line expressing cDNA encoding the alpha subunit (Nav1.7, SCN9a, PN1, NE) of human Nav1.7 (Access...
In DepthDetails US Patent
TargetSodium channel protein type 9 subunit alpha(Homo sapiens (Human))
Purdue Pharma
US Patent
LigandPNGBDBM162459(US9056832, 78 | US9611222, Example 78)
Affinity DataIC50:  1.50E+4nM. Assay description: Recombinant Nav1.7 Cell Line: In vitro assays were performed in a recombinant cell line expressing cDNA encoding the alpha subunit (Nav1.7, SCN9a, PN...
In DepthDetails US Patent