BDBM162470 US9056832, 89::US9611222, Example 89
SMILES NC(=O)c1cc(nc(c1)-c1ccc(Oc2ccc(F)cc2)cc1)[C@@H](O)CO
InChI Key InChIKey=MEHAWPOUCOQHSN-IBGZPJMESA-N
Data  2 IC50
  Tab Delimited (TSV)   2D SDfile   Computed 3D by Vconf -m prep SDfile
Find this compound or compounds like it in BindingDB:
Activity Spreadsheet -- Enzyme Inhibition Constant Data from BindingDB
Found 2 hits for monomerid = 162470
TargetSodium channel protein type 9 subunit alpha(Homo sapiens (Human))
Purdue Pharma
US Patent
LigandPNGBDBM162470(US9056832, 89 | US9611222, Example 89)
Affinity DataIC50:  7.13E+3nM. Assay description: In vitro assays were performed in a recombinant cell line expressing cDNA encoding the alpha subunit (Nav1.7, SCN9a, PN1, NE) of human Nav1.7 (Access...
Ligand InfoPC cidPC sid
In DepthDetails US Patent
TargetSodium channel protein type 9 subunit alpha(Homo sapiens (Human))
Purdue Pharma
US Patent
LigandPNGBDBM162470(US9056832, 89 | US9611222, Example 89)
Affinity DataIC50:  7.13E+3nM. Assay description: Recombinant Nav1.7 Cell Line: In vitro assays were performed in a recombinant cell line expressing cDNA encoding the alpha subunit (Nav1.7, SCN9a, PN...
Ligand InfoPC cidPC sid
In DepthDetails US Patent