BDBM162491 US9056832, 110::US9611222, Example 110
SMILES Fc1ccc(Oc2ccc(cc2)-c2cc(NCCCn3ccnc3)cc(n2)C#N)cc1
InChI Key InChIKey=UGARCTBBNMTZRH-UHFFFAOYSA-N
Data  2 IC50
  Tab Delimited (TSV)   2D SDfile   Computed 3D by Vconf -m prep SDfile
Find this compound or compounds like it in BindingDB:
Activity Spreadsheet -- Enzyme Inhibition Constant Data from BindingDB
Found 2 hits for monomerid = 162491
TargetSodium channel protein type 9 subunit alpha(Homo sapiens (Human))
Purdue Pharma
US Patent
LigandPNGBDBM162491(US9056832, 110 | US9611222, Example 110)
Affinity DataIC50:  620nM. Assay description: In vitro assays were performed in a recombinant cell line expressing cDNA encoding the alpha subunit (Nav1.7, SCN9a, PN1, NE) of human Nav1.7 (Access...
Ligand InfoPC cidPC sid
In DepthDetails US Patent
TargetSodium channel protein type 9 subunit alpha(Homo sapiens (Human))
Purdue Pharma
US Patent
LigandPNGBDBM162491(US9056832, 110 | US9611222, Example 110)
Affinity DataIC50:  620nM. Assay description: Recombinant Nav1.7 Cell Line: In vitro assays were performed in a recombinant cell line expressing cDNA encoding the alpha subunit (Nav1.7, SCN9a, PN...
Ligand InfoPC cidPC sid
In DepthDetails US Patent