BDBM162500 US9056832, 119::US9611222, Example 119
SMILES CN(c1ccccc1)c1cc(cc(n1)C(O)=O)-c1ccc(Oc2ccc(F)cc2)cc1
InChI Key InChIKey=CJLQZBBQDNYGCJ-UHFFFAOYSA-N
Data  2 IC50
  Tab Delimited (TSV)   2D SDfile   Computed 3D by Vconf -m prep SDfile
Find this compound or compounds like it in BindingDB:
Activity Spreadsheet -- Enzyme Inhibition Constant Data from BindingDB
Found 2 hits for monomerid = 162500
TargetSodium channel protein type 9 subunit alpha(Homo sapiens (Human))
Purdue Pharma
US Patent
LigandPNGBDBM162500(US9056832, 119 | US9611222, Example 119)
Affinity DataIC50:  2.46E+3nM. Assay description: In vitro assays were performed in a recombinant cell line expressing cDNA encoding the alpha subunit (Nav1.7, SCN9a, PN1, NE) of human Nav1.7 (Access...
In DepthDetails US Patent
TargetSodium channel protein type 9 subunit alpha(Homo sapiens (Human))
Purdue Pharma
US Patent
LigandPNGBDBM162500(US9056832, 119 | US9611222, Example 119)
Affinity DataIC50:  2.46E+3nM. Assay description: Recombinant Nav1.7 Cell Line: In vitro assays were performed in a recombinant cell line expressing cDNA encoding the alpha subunit (Nav1.7, SCN9a, PN...
In DepthDetails US Patent