BDBM162519 US9687478, 109
SMILES OC1(C2C=CC=CC2C2C=CC=CC12)C(=O)O[C@H]1C[N+]2(CCCc3cccs3)CCC1CC2
InChI Key InChIKey=CNJZRYJQSFDHSO-SQWRETMTSA-N
Data  1 IC50
  Tab Delimited (TSV)   2D SDfile   Computed 3D by Vconf -m prep SDfile
Find this compound or compounds like it in BindingDB:
Activity Spreadsheet -- Enzyme Inhibition Constant Data from BindingDB
Found 1 hit for monomerid = 162519
TargetMuscarinic acetylcholine receptor M3(Homo sapiens (Human))
Almirall
US Patent
LigandPNGBDBM162519(US9687478, 109)
Affinity DataIC50:  31nMT: 2°C. Assay description: Assays were carried out at 25° C. Membrane preparations from stably transfected chinese hamster ovary-K1 cells (CHO) expressing the genes for the...
Ligand InfoPC cidPC sid
In DepthDetails US Patent