BDBM162696 US9056836, 10
SMILES OC(=O)CCC[C@]12CCN(CC3CC3)[C@H](Cc3ccc(O)cc13)[C@@H]2CC(O)=O
InChI Key InChIKey=SMCHHBDIAXVTAE-JQVVWYNYSA-N
Data  2 KI
  Tab Delimited (TSV)   2D SDfile   Computed 3D by Vconf -m prep SDfile
Find this compound or compounds like it in BindingDB:
Activity Spreadsheet -- Enzyme Inhibition Constant Data from BindingDB
Found 2 hits for monomerid = 162696
TargetKappa-type opioid receptor(Homo sapiens (Human))
Purdue Pharma
US Patent
LigandPNGBDBM162696(US9056836, 10)
Affinity DataKi:  64.5nM ΔG°:  -9.80kcal/molepH: 7.4 T: 2°C. Assay description: Radioligand dose displacement assays used 0.4 nM [3]-U69,593 (GE Healthcare, Piscataway, N.J.; 40 Ci/mmole) with 15 ug membrane protein (recombinant ...
In DepthDetails US Patent
TargetMu-type opioid receptor(Homo sapiens (Human))
Purdue Pharma
US Patent
LigandPNGBDBM162696(US9056836, 10)
Affinity DataKi:  977nM ΔG°:  -8.88kcal/molepH: 7.4 T: 2°C. Assay description: Radioligand dose-displacement binding assays for mu-opioid receptors used 0.3 nM [3H]-diprenorphine (Perkin Elmer, Shelton, Conn.), with 5 mg membran...
In DepthDetails US Patent