BDBM162715 US9056843, 6
SMILES CCCCNC(=O)Cc1ccc(cc1)-c1noc(n1)C(F)(F)F
InChI Key InChIKey=FGWWMUDKFJLEEP-UHFFFAOYSA-N
Data  3 IC50
  Tab Delimited (TSV)   2D SDfile   Computed 3D by Vconf -m prep SDfile
Find this compound or compounds like it in BindingDB:
Activity Spreadsheet -- Enzyme Inhibition Constant Data from BindingDB
Found 3 hits for monomerid = 162715
TargetHistone deacetylase 1(Homo sapiens (Human))
Novartis
US Patent
LigandPNGBDBM162715(US9056843, 6)
Affinity DataIC50: >1.00E+4nMpH: 8.0 T: 2°C. Assay description: A similar assay procedure as described in Test 2 was used for HDAC1. Human recombinant full length HDAC1 expressed in a baculovirus expression system...
In DepthDetails US Patent
TargetHistone deacetylase 6(Homo sapiens (Human))
Novartis
US Patent
LigandPNGBDBM162715(US9056843, 6)
Affinity DataIC50:  3.20E+3nMpH: 8.0 T: 2°C. Assay description: A similar assay procedure as described in Test 2 was used for HDAC6. Human recombinant full length HDAC6 expressed in a baculovirus expression system...
In DepthDetails US Patent
TargetHistone deacetylase 4(Homo sapiens (Human))
Novartis
US Patent
LigandPNGBDBM162715(US9056843, 6)
Affinity DataIC50:  630nMpH: 8.0 T: 2°C. Assay description: Human recombinant HDAC4 was expressed in full length form (aa 2-1084) in Sf9 insect cells (obtained from ATCC) using baculovirus generated with Bac-t...
In DepthDetails US Patent