BDBM162718 US9056843, 9
SMILES FC(F)(F)c1nc(no1)-c1ccc(CC(=O)N2CCOCC2)cc1
InChI Key InChIKey=CFKSFKXROKZYDV-UHFFFAOYSA-N
Data  3 IC50
  Tab Delimited (TSV)   2D SDfile   Computed 3D by Vconf -m prep SDfile
Find this compound or compounds like it in BindingDB:
Activity Spreadsheet -- Enzyme Inhibition Constant Data from BindingDB
Found 3 hits for monomerid = 162718
TargetHistone deacetylase 1(Homo sapiens (Human))
Novartis
US Patent
LigandPNGBDBM162718(US9056843, 9)
Affinity DataIC50: >1.00E+4nMpH: 8.0 T: 2°C. Assay description: A similar assay procedure as described in Test 2 was used for HDAC1. Human recombinant full length HDAC1 expressed in a baculovirus expression system...
In DepthDetails US Patent
TargetHistone deacetylase 6(Homo sapiens (Human))
Novartis
US Patent
LigandPNGBDBM162718(US9056843, 9)
Affinity DataIC50:  5.50E+3nMpH: 8.0 T: 2°C. Assay description: A similar assay procedure as described in Test 2 was used for HDAC6. Human recombinant full length HDAC6 expressed in a baculovirus expression system...
In DepthDetails US Patent
TargetHistone deacetylase 4(Homo sapiens (Human))
Novartis
US Patent
LigandPNGBDBM162718(US9056843, 9)
Affinity DataIC50:  850nMpH: 8.0 T: 2°C. Assay description: Human recombinant HDAC4 was expressed in full length form (aa 2-1084) in Sf9 insect cells (obtained from ATCC) using baculovirus generated with Bac-t...
In DepthDetails US Patent