BDBM162879 US11419874, Example 28::US9056863, Example Ic1
SMILES Cc1nc2ccncc2n2c(nnc12)-c1ccccc1Cl
InChI Key InChIKey=SNQXTEAQGLZIDL-UHFFFAOYSA-N
Data  11 IC50
  Tab Delimited (TSV)   2D SDfile   Computed 3D by Vconf -m prep SDfile
Find this compound or compounds like it in BindingDB:
Activity Spreadsheet -- Enzyme Inhibition Constant Data from BindingDB
Found 11 hits for monomerid = 162879
TargetcGMP-dependent 3',5'-cyclic phosphodiesterase(Homo sapiens (Human))
H. Lundbeck
US Patent
LigandPNGBDBM162879(US11419874, Example 28 | US9056863, Example Ic1)
Affinity DataIC50:  69nMpH: 7.6 T: 2°C. Assay description: A typical PDE2A assay was performed as follows: the assay was performed in 60 μL samples containing a fixed amount of the PDE2A enzyme (sufficie...
In DepthDetails US Patent
TargetDual 3',5'-cyclic-AMP and -GMP phosphodiesterase 11A(Homo sapiens (Human))
Janssen Pharmaceutica
Curated by ChEMBL
LigandPNGBDBM162879(US11419874, Example 28 | US9056863, Example Ic1)
Affinity DataIC50:  6.92E+3nM. Assay description: Inhibition of full length human PDE11A4 expressed in HEK cells by scintillation proximity assay
In DepthDetails ArticlePubMed
TargetcAMP and cAMP-inhibited cGMP 3',5'-cyclic phosphodiesterase 10A(Rattus norvegicus (rat))
Janssen Pharmaceutica
Curated by ChEMBL
LigandPNGBDBM162879(US11419874, Example 28 | US9056863, Example Ic1)
Affinity DataIC50:  480nM. Assay description: Inhibition of 6-His-tagged rat recombinant PDE10A expressed in Sf9 cells using [3H]cAMP incubated for 60 mins by scintillation proximity assay
In DepthDetails ArticlePubMed
TargetHigh affinity cGMP-specific 3',5'-cyclic phosphodiesterase 9A(Homo sapiens (Human))
Janssen Pharmaceutica
Curated by ChEMBL
LigandPNGBDBM162879(US11419874, Example 28 | US9056863, Example Ic1)
Affinity DataIC50: >1.00E+4nM. Assay description: Inhibition of 6-His-tagged human recombinant PDE9A1 expressed in Sf9 cells by scintillation proximity assay
In DepthDetails ArticlePubMed
TargetHigh affinity cAMP-specific 3',5'-cyclic phosphodiesterase 7A(Homo sapiens (Human))
Janssen Pharmaceutica
Curated by ChEMBL
LigandPNGBDBM162879(US11419874, Example 28 | US9056863, Example Ic1)
Affinity DataIC50: >1.00E+4nM. Assay description: Inhibition of 6-His-tagged human recombinant PDE7A1 expressed in Sf9 cells by scintillation proximity assay
In DepthDetails ArticlePubMed
TargetcAMP and cAMP-inhibited cGMP 3',5'-cyclic phosphodiesterase 10A(Rattus norvegicus (rat))
Janssen Pharmaceutica
Curated by ChEMBL
LigandPNGBDBM162879(US11419874, Example 28 | US9056863, Example Ic1)
Affinity DataIC50:  480nM. Assay description: Isolated cardiomyocytes were washed twice in PBS at room temperature, transferred to 4% paraformaldehyde (PFA) and gently shaken for 30 min, then was...
In DepthDetails US Patent
TargetcGMP-inhibited 3',5'-cyclic phosphodiesterase 3B(Homo sapiens (Human))
Janssen Pharmaceutica
Curated by ChEMBL
LigandPNGBDBM162879(US11419874, Example 28 | US9056863, Example Ic1)
Affinity DataIC50: >1.00E+4nM. Assay description: Inhibition of human PDE3B by scintillation proximity assay
In DepthDetails ArticlePubMed
LigandPNGBDBM162879(US11419874, Example 28 | US9056863, Example Ic1)
Affinity DataIC50: >1.00E+4nM. Assay description: Inhibition of human PDE1A by scintillation proximity assay
In DepthDetails ArticlePubMed
TargetcGMP-dependent 3',5'-cyclic phosphodiesterase(Homo sapiens (Human))
H. Lundbeck
US Patent
LigandPNGBDBM162879(US11419874, Example 28 | US9056863, Example Ic1)
Affinity DataIC50:  29nM. Assay description: Inhibition of 6-His-tagged human recombinant PDE2A expressed in Sf9 cells using [3H]cGMP incubated for 40 mins by scintillation proximity assay
In DepthDetails ArticlePubMed
TargetcGMP-dependent 3',5'-cyclic phosphodiesterase(Homo sapiens (Human))
H. Lundbeck
US Patent
LigandPNGBDBM162879(US11419874, Example 28 | US9056863, Example Ic1)
Affinity DataIC50:  29nM. Assay description: Isolated cardiomyocytes were washed twice in PBS at room temperature, transferred to 4% paraformaldehyde (PFA) and gently shaken for 30 min, then was...
In DepthDetails US Patent
TargetcAMP-specific 3',5'-cyclic phosphodiesterase 4D(Homo sapiens (Human))
Janssen Pharmaceutica
Curated by ChEMBL
LigandPNGBDBM162879(US11419874, Example 28 | US9056863, Example Ic1)
Affinity DataIC50:  5.89E+3nM. Assay description: Inhibition of 6-His-tagged human recombinant PDE4D3 expressed in Sf9 cells by scintillation proximity assay
In DepthDetails ArticlePubMed