BDBM163047 US9062004, 10::US9670216, 10 4-Chloro-2-cyclohexyl-5-propylaminopyridazin-3-one
SMILES CCCNc1cnn(C2CCCCC2)c(=O)c1Cl
InChI Key InChIKey=MHQMSQLDTCHRKC-UHFFFAOYSA-N
Data  2 IC50
  Tab Delimited (TSV)   2D SDfile   Computed 3D by Vconf -m prep SDfile
Find this compound or compounds like it in BindingDB:
Activity Spreadsheet -- Enzyme Inhibition Constant Data from BindingDB
Found 2 hits for monomerid = 163047
TargetCannabinoid receptor 2(Homo sapiens (Human))
Allergan
US Patent
LigandPNGBDBM163047(US9062004, 10 | US9670216, 10 4-Chloro-2-cyclohexy...)
Affinity DataIC50:  1.00E+4nMT: 2°C. Assay description: Plasma membranes prepared from HEK 293 EBNA cells transfected with human CB1 or CB2 cannabinoid receptors (3.7 or 3.3 pmol/mg protein, receptor conce...
In DepthDetails US Patent
TargetCannabinoid receptor 2(Homo sapiens (Human))
Allergan
US Patent
LigandPNGBDBM163047(US9062004, 10 | US9670216, 10 4-Chloro-2-cyclohexy...)
Affinity DataIC50:  1.00E+4nM. Assay description: Plasma membranes prepared from HEK 293 EBNA cells transfected with human CB1 or CB2 cannabinoid receptors (3.7 or 3.3 .mu.mol/mg protein, receptor co...
In DepthDetails US Patent