BDBM163129 US9062026, Table III, Compound 57
SMILES Cc1cc2ccccc2n1-c1nc2CN(CCc2c(NCc2ccccc2)n1)C(=O)OC(C)(C)C
InChI Key InChIKey=MQOOWCFINZYULU-UHFFFAOYSA-N
Data  1 IC50
  Tab Delimited (TSV)   2D SDfile   Computed 3D by Vconf -m prep SDfile
Find this compound or compounds like it in BindingDB:
Activity Spreadsheet -- Enzyme Inhibition Constant Data from BindingDB
Found 1 hit for monomerid = 163129
TargetTransitional endoplasmic reticulum ATPase(Homo sapiens (Human))
Cleave Biosciences
US Patent
LigandPNGBDBM163129(US9062026, Table III, Compound 57)
Affinity DataIC50: <2.00E+3nMpH: 7.5 T: 2°C. Assay description: The ATPase assay is performed according the following protocol: Purified enzyme (20 nM p97), substrate (20 uM ATP) and a dose titration of compounds ...
In DepthDetails US Patent