BDBM163145 US9062026, Table III, Compound 73
SMILES COCc1cc2ccccc2n1-c1nc2CCCCc2c(NCc2ccccc2)n1
InChI Key InChIKey=FJBXWIXSOMBRKC-UHFFFAOYSA-N
Data  2 IC50
  Tab Delimited (TSV)   2D SDfile   Computed 3D by Vconf -m prep SDfile
Find this compound or compounds like it in BindingDB:
Activity Spreadsheet -- Enzyme Inhibition Constant Data from BindingDB
Found 2 hits for monomerid = 163145
TargetTransitional endoplasmic reticulum ATPase(Homo sapiens (Human))
Cleave Biosciences
Curated by ChEMBL
LigandPNGBDBM163145(US9062026, Table III, Compound 73)
Affinity DataIC50:  795nM. Assay description: Inhibition of human p97 ATPase incubated for 15 mins by ADP Glo luminescence assay
In DepthDetails ArticlePubMed
TargetTransitional endoplasmic reticulum ATPase(Homo sapiens (Human))
Cleave Biosciences
Curated by ChEMBL
LigandPNGBDBM163145(US9062026, Table III, Compound 73)
Affinity DataIC50: <2.00E+3nMpH: 7.5 T: 2°C. Assay description: The ATPase assay is performed according the following protocol: Purified enzyme (20 nM p97), substrate (20 uM ATP) and a dose titration of compounds ...
In DepthDetails US Patent