BDBM16339 4-(3-chlorophenyl)-5-[3-(propan-2-yl)-[1,2,4]triazolo[3,4-a]pyridin-6-yl]-1,3-oxazole::triazolopyridine oxazole inhibitor 9
SMILES CC(C)c1nnc2ccc(cn12)-c1ocnc1-c1cccc(Cl)c1
InChI Key InChIKey=KEAXLOURFDQQDT-UHFFFAOYSA-N
Data  1 IC50
  Tab Delimited (TSV)   2D SDfile   Computed 3D by Vconf -m prep SDfile
Find this compound or compounds like it in BindingDB:
Activity Spreadsheet -- Enzyme Inhibition Constant Data from BindingDB
Found 1 hit for monomerid = 16339
TargetMitogen-activated protein kinase 14(Homo sapiens (Human))
Pfizer
LigandPNGBDBM16339(4-(3-chlorophenyl)-5-[3-(propan-2-yl)-[1,2,4]triaz...)
Affinity DataIC50:  13.5nMpH: 7.2 T: 2°C. Assay description: The IC50s were determined by incubating each test compound with activated p38-alpha in a 96-well plate that had been pre-treated with ATF-2-GST to al...
In DepthDetails ArticlePubMed