BDBM16371 6-[4-(4-fluorophenyl)-1,3-oxazol-5-yl]-N,N-dimethyl-[1,2,4]triazolo[3,4-a]pyridin-3-amine::triazolopyridine oxazole inhibitor 42
SMILES CN(C)c1nnc2ccc(cn12)-c1ocnc1-c1ccc(F)cc1
InChI Key InChIKey=AROFKXHYEPABPV-UHFFFAOYSA-N
Data  1 IC50
  Tab Delimited (TSV)   2D SDfile   Computed 3D by Vconf -m prep SDfile
Find this compound or compounds like it in BindingDB:
Activity Spreadsheet -- Enzyme Inhibition Constant Data from BindingDB
Found 1 hit for monomerid = 16371
TargetMitogen-activated protein kinase 14(Homo sapiens (Human))
Pfizer
LigandPNGBDBM16371(6-[4-(4-fluorophenyl)-1,3-oxazol-5-yl]-N,N-dimethy...)
Affinity DataIC50:  15.3nM. Assay description: The IC50s were determined by incubating each test compound with activated p38-alpha in a 96-well plate that had been pre-treated with ATF-2-GST to al...
In DepthDetails ArticlePubMed