BDBM163714 5-{4-[4-(2-(Methylthio)phenyl)piperazin-1-yl]butyl}-3-phenyl-4,5-dihydro-1,2,4-triazin-6(1H)-one (13)
SMILES CSc1ccccc1N1CCN(CCCCC2NC(=NNC2=O)c2ccccc2)CC1
InChI Key InChIKey=VXEGBWJMXLJVSC-UHFFFAOYSA-N
Data  2 KI
  Tab Delimited (TSV)   2D SDfile   Computed 3D by Vconf -m prep SDfile
Find this compound or compounds like it in BindingDB:
Activity Spreadsheet -- Enzyme Inhibition Constant Data from BindingDB
Found 2 hits for monomerid = 163714
Target5-hydroxytryptamine receptor 7(Homo sapiens (Human))
Jagiellonian University Medical College
LigandPNGBDBM163714(5-{4-[4-(2-(Methylthio)phenyl)piperazin-1-yl]butyl...)
Affinity DataKi:  17nM ΔG°:  -10.6kcal/moleT: 2°C. Assay description: All assays were incubated in a total volume of 200 mL in 96-well microtiter plates for 1 h at 37 °C, except for 5-HT1ARs which were incubated at room...
In DepthDetails ArticlePubMed
Target5-hydroxytryptamine receptor 1A(Homo sapiens (Human))
Jagiellonian University Medical College
LigandPNGBDBM163714(5-{4-[4-(2-(Methylthio)phenyl)piperazin-1-yl]butyl...)
Affinity DataKi:  28nM ΔG°:  -10.3kcal/moleT: 2°C. Assay description: All assays were incubated in a total volume of 200 mL in 96-well microtiter plates for 1 h at 37 °C, except for 5-HT1ARs which were incubated at room...
In DepthDetails ArticlePubMed