BDBM163915 US9062078, 46::US9475819, 46::US9637496, 46::US9695183, 46
SMILES Cc1cc(C)nc(OCC2CC3CCC2N3C(=O)c2ccccc2-c2cccs2)n1
InChI Key InChIKey=PYEBVJKPFDDXSJ-UHFFFAOYSA-N
Data  8 KI
  Tab Delimited (TSV)   2D SDfile   Computed 3D by Vconf -m prep SDfile
Find this compound or compounds like it in BindingDB:
Activity Spreadsheet -- Enzyme Inhibition Constant Data from BindingDB
Found 8 hits for monomerid = 163915
TargetOrexin receptor type 2(Homo sapiens (Human))
Janssen Pharmaceutica
US Patent
LigandPNGBDBM163915(US9062078, 46 | US9475819, 46 | US9637496, 46 | US...)
Affinity DataKi:  10nM ΔG°:  -11.5kcal/moleT: 2°C. Assay description: HEK293 stably expressing human orexin 2 receptor (Genebank accession number NM_001526) were grown to confluency in DMEM (Hyclone, cat #SH30022), 10% ...
Ligand InfoPC cidPC sid
In DepthDetails US Patent
TargetOrexin receptor type 2(Homo sapiens (Human))
Janssen Pharmaceutica
US Patent
LigandPNGBDBM163915(US9062078, 46 | US9475819, 46 | US9637496, 46 | US...)
Affinity DataKi:  10nM ΔG°:  -11.5kcal/moleT: 2°C. Assay description: HEK293 stably expressing human orexin 2 receptor (Genebank accession number NM_001526) were grown to confluency in DMEM (Hyclone, cat # SH30022), 10%...
Ligand InfoPC cidPC sid
In DepthDetails US Patent
TargetOrexin receptor type 2(Homo sapiens (Human))
Janssen Pharmaceutica
US Patent
LigandPNGBDBM163915(US9062078, 46 | US9475819, 46 | US9637496, 46 | US...)
Affinity DataKi:  10nM. Assay description: HEK293 stably expressing human orexin 2 receptor (Genebank accession number NM_001526) were grown to confluency in DMEM (Hyclone, cat #SH30022), 10% ...
Ligand InfoPC cidPC sid
In DepthDetails US Patent
TargetOrexin receptor type 2(Homo sapiens (Human))
Janssen Pharmaceutica
US Patent
LigandPNGBDBM163915(US9062078, 46 | US9475819, 46 | US9637496, 46 | US...)
Affinity DataKi:  10nM ΔG°:  -11.5kcal/moleT: 2°C. Assay description: HEK293 stably expressing human orexin 2 receptor (Genebank accession number NM001526) were grown to confluency in DMEM (Hyclone, cat #SH30022), 10% F...
Ligand InfoPC cidPC sid
In DepthDetails US Patent
TargetOrexin/Hypocretin receptor type 1(Homo sapiens (Human))
Janssen Pharmaceutica
US Patent
LigandPNGBDBM163915(US9062078, 46 | US9475819, 46 | US9637496, 46 | US...)
Affinity DataKi:  82nM. Assay description: Human Embryonic Kidney 293 cells (HEK293) stably expressing rat orexin 1 receptor (Genebank accession number NM_001525) or Chinese ovary cells (CHO) ...
Ligand InfoPC cidPC sid
In DepthDetails US Patent
TargetOrexin/Hypocretin receptor type 1(Homo sapiens (Human))
Janssen Pharmaceutica
US Patent
LigandPNGBDBM163915(US9062078, 46 | US9475819, 46 | US9637496, 46 | US...)
Affinity DataKi:  82nM ΔG°:  -8.98kcal/moleT: 2°C. Assay description: Human Embryonic Kidney 293 cells (HEK293) stably expressing rat orexin 1 receptor (Genebank accession number NM_001525) or Chinese ovary cells (CHO) ...
Ligand InfoPC cidPC sid
In DepthDetails US Patent
TargetOrexin/Hypocretin receptor type 1(Homo sapiens (Human))
Janssen Pharmaceutica
US Patent
LigandPNGBDBM163915(US9062078, 46 | US9475819, 46 | US9637496, 46 | US...)
Affinity DataKi:  82nM ΔG°:  -8.98kcal/moleT: 2°C. Assay description: Human Embryonic Kidney 293 cells (HEK293) stably expressing rat orexin 1 receptor (Genebank accession number NM_001525) or Chinese ovary cells (CHO) ...
Ligand InfoPC cidPC sid
In DepthDetails US Patent
TargetOrexin/Hypocretin receptor type 1(Homo sapiens (Human))
Janssen Pharmaceutica
US Patent
LigandPNGBDBM163915(US9062078, 46 | US9475819, 46 | US9637496, 46 | US...)
Affinity DataKi:  82nM ΔG°:  -8.98kcal/moleT: 2°C. Assay description: Human Embryonic Kidney 293 cells (HEK293) stably expressing rat orexin 1 receptor (Genebank accession number NM001525) or Chinese ovary cells (CHO) s...
Ligand InfoPC cidPC sid
In DepthDetails US Patent