BDBM164159 US9062078, 289::US9475819, 289::US9637496, 289::US9695183, 289
SMILES COc1cccc(-c2ncccn2)c1C(=O)N1C2CCC1C(C2)Nc1cnc(cn1)C(F)(F)F
InChI Key InChIKey=SYVOSCRGVASQFY-UHFFFAOYSA-N
Data  12 KI
  Tab Delimited (TSV)   2D SDfile   Computed 3D by Vconf -m prep SDfile
Find this compound or compounds like it in BindingDB:
Activity Spreadsheet -- Enzyme Inhibition Constant Data from BindingDB
Found 12 hits for monomerid = 164159
TargetOrexin/Hypocretin receptor type 1(Rattus norvegicus (Rat))
Janssen Pharmaceutica
US Patent
LigandPNGBDBM164159(US9062078, 289 | US9475819, 289 | US9637496, 289 |...)
Affinity DataKi:  13nM. Assay description: Human Embryonic Kidney 293 cells (HEK293) stably expressing rat orexin 1 receptor (Genebank accession number NM_001525) or Chinese ovary cells (CHO) ...
In DepthDetails US Patent
TargetOrexin/Hypocretin receptor type 1(Rattus norvegicus (Rat))
Janssen Pharmaceutica
US Patent
LigandPNGBDBM164159(US9062078, 289 | US9475819, 289 | US9637496, 289 |...)
Affinity DataKi:  13nM ΔG°:  -11.3kcal/moleT: 2°C. Assay description: HEK293 stably expressing human orexin 2 receptor (Genebank accession number NM001526) were grown to confluency in DMEM (Hyclone, cat #SH30022), 10% F...
In DepthDetails US Patent
TargetOrexin/Hypocretin receptor type 1(Rattus norvegicus (Rat))
Janssen Pharmaceutica
US Patent
LigandPNGBDBM164159(US9062078, 289 | US9475819, 289 | US9637496, 289 |...)
Affinity DataKi:  13nM ΔG°:  -9.99kcal/moleT: 2°C. Assay description: Human Embryonic Kidney 293 cells (HEK293) stably expressing rat orexin 1 receptor (Genebank accession number NM_001525) or Chinese ovary cells (CHO) ...
In DepthDetails US Patent
TargetOrexin/Hypocretin receptor type 1(Rattus norvegicus (Rat))
Janssen Pharmaceutica
US Patent
LigandPNGBDBM164159(US9062078, 289 | US9475819, 289 | US9637496, 289 |...)
Affinity DataKi:  13nM ΔG°:  -9.99kcal/moleT: 2°C. Assay description: Human Embryonic Kidney 293 cells (HEK293) stably expressing rat orexin 1 receptor (Genebank accession number NM_001525) or Chinese ovary cells (CHO) ...
In DepthDetails US Patent
TargetOrexin/Hypocretin receptor type 1(Homo sapiens (Human))
Janssen Pharmaceutica
US Patent
LigandPNGBDBM164159(US9062078, 289 | US9475819, 289 | US9637496, 289 |...)
Affinity DataKi:  32nM. Assay description: Human Embryonic Kidney 293 cells (HEK293) stably expressing rat orexin 1 receptor (Genebank accession number NM_001525) or Chinese ovary cells (CHO) ...
In DepthDetails US Patent
TargetOrexin/Hypocretin receptor type 1(Homo sapiens (Human))
Janssen Pharmaceutica
US Patent
LigandPNGBDBM164159(US9062078, 289 | US9475819, 289 | US9637496, 289 |...)
Affinity DataKi:  32nM ΔG°:  -9.50kcal/moleT: 2°C. Assay description: Human Embryonic Kidney 293 cells (HEK293) stably expressing rat orexin 1 receptor (Genebank accession number NM_001525) or Chinese ovary cells (CHO) ...
In DepthDetails US Patent
TargetOrexin/Hypocretin receptor type 1(Homo sapiens (Human))
Janssen Pharmaceutica
US Patent
LigandPNGBDBM164159(US9062078, 289 | US9475819, 289 | US9637496, 289 |...)
Affinity DataKi:  32nM ΔG°:  -9.50kcal/moleT: 2°C. Assay description: Human Embryonic Kidney 293 cells (HEK293) stably expressing rat orexin 1 receptor (Genebank accession number NM001525) or Chinese ovary cells (CHO) s...
In DepthDetails US Patent
TargetOrexin/Hypocretin receptor type 1(Homo sapiens (Human))
Janssen Pharmaceutica
US Patent
LigandPNGBDBM164159(US9062078, 289 | US9475819, 289 | US9637496, 289 |...)
Affinity DataKi:  32nM ΔG°:  -9.50kcal/moleT: 2°C. Assay description: Human Embryonic Kidney 293 cells (HEK293) stably expressing rat orexin 1 receptor (Genebank accession number NM_001525) or Chinese ovary cells (CHO) ...
In DepthDetails US Patent
TargetOrexin receptor type 2(Homo sapiens (Human))
Janssen Pharmaceutica
US Patent
LigandPNGBDBM164159(US9062078, 289 | US9475819, 289 | US9637496, 289 |...)
Affinity DataKi:  173nM ΔG°:  -9.68kcal/moleT: 2°C. Assay description: HEK293 stably expressing human orexin 2 receptor (Genebank accession number NM_001526) were grown to confluency in DMEM (Hyclone, cat # SH30022), 10%...
In DepthDetails US Patent
TargetOrexin receptor type 2(Homo sapiens (Human))
Janssen Pharmaceutica
US Patent
LigandPNGBDBM164159(US9062078, 289 | US9475819, 289 | US9637496, 289 |...)
Affinity DataKi:  173nM. Assay description: HEK293 stably expressing human orexin 2 receptor (Genebank accession number NM_001526) were grown to confluency in DMEM (Hyclone, cat #SH30022), 10% ...
In DepthDetails US Patent
TargetOrexin receptor type 2(Homo sapiens (Human))
Janssen Pharmaceutica
US Patent
LigandPNGBDBM164159(US9062078, 289 | US9475819, 289 | US9637496, 289 |...)
Affinity DataKi:  173nM ΔG°:  -9.68kcal/moleT: 2°C. Assay description: HEK293 stably expressing human orexin 2 receptor (Genebank accession number NM001526) were grown to confluency in DMEM (Hyclone, cat #SH30022), 10% F...
In DepthDetails US Patent
TargetOrexin receptor type 2(Homo sapiens (Human))
Janssen Pharmaceutica
US Patent
LigandPNGBDBM164159(US9062078, 289 | US9475819, 289 | US9637496, 289 |...)
Affinity DataKi:  173nM ΔG°:  -9.68kcal/moleT: 2°C. Assay description: HEK293 stably expressing human orexin 2 receptor (Genebank accession number NM_001526) were grown to confluency in DMEM (Hyclone, cat #SH30022), 10% ...
In DepthDetails US Patent