BDBM164382 US9669029, 85 8-Methyl-2-[2-(1-methyl-4-thiophen-2-yl-1H-imidazol-2-yl)-ethyl]-[1,2,4]triazolo[1,5-a]pyridine
SMILES CC1=CC=CN2N=C(CCc3nc(cn3C)-c3cccs3)NC12
InChI Key InChIKey=MSDWYJRINGTFHM-UHFFFAOYSA-N
Data  1 IC50
  Tab Delimited (TSV)   2D SDfile   Computed 3D by Vconf -m prep SDfile
Find this compound or compounds like it in BindingDB:
Activity Spreadsheet -- Enzyme Inhibition Constant Data from BindingDB
Found 1 hit for monomerid = 164382
TargetcAMP and cAMP-inhibited cGMP 3',5'-cyclic phosphodiesterase 10A [440-779](Homo sapiens (Human))
H. Lundbeck
US Patent
LigandPNGBDBM164382(US9669029, 85 8-Methyl-2-[2-(1-methyl-4-thiophen-2...)
Affinity DataIC50:  15nMT: 2°C. Assay description: The assay is performed in 60 uL samples containing a fixed amount of the relevant PDE enzyme (sufficient to convert 20-25% of the cyclic nucleotide s...
Ligand InfoPC cidPC sid
In DepthDetails US Patent