BDBM16492 2-{3-[(4,5,7-trifluoro-1,3-benzothiazol-2-yl)carbonyl]-1H-indol-1-yl}acetic acid::Indoleacetic Acid Inhibitor 48
SMILES OC(=O)Cn1cc(C(=O)c2nc3c(F)c(F)cc(F)c3s2)c2ccccc12
InChI Key InChIKey=LAFPEARAJSRTIU-UHFFFAOYSA-N
Data  1 IC50
  Tab Delimited (TSV)   2D SDfile   Computed 3D by Vconf -m prep SDfile
Find this compound or compounds like it in BindingDB:
Activity Spreadsheet -- Enzyme Inhibition Constant Data from BindingDB
Found 1 hit for monomerid = 16492
TargetAldo-keto reductase family 1 member B1(Homo sapiens (Human))
The Institute For Diabetes Discovery
LigandPNGBDBM16492(2-{3-[(4,5,7-trifluoro-1,3-benzothiazol-2-yl)carbo...)
Affinity DataIC50:  1.60E+3nM. Assay description: The activity of the test enzyme was determined spectrophotometrically by monitoring the change in absorbance at 340 nm, which is due to the disappear...
In DepthDetails ArticlePubMed