BDBM165933 US10214524, Example 150::US9067931, 150
SMILES OCc1ccccc1-c1cccc2cc(oc12)C(=O)N[C@H]1CN2CCC1CC2
InChI Key InChIKey=DHOHZNJDTBESFH-FQEVSTJZSA-N
Data  2 KI
  Tab Delimited (TSV)   2D SDfile   Computed 3D by Vconf -m prep SDfile
Find this compound or compounds like it in BindingDB:
Activity Spreadsheet -- Enzyme Inhibition Constant Data from BindingDB
Found 2 hits for monomerid = 165933
TargetNeuronal acetylcholine receptor subunit alpha-7(Rattus norvegicus (Rat))
Bayer Intellectual Property
US Patent
LigandPNGBDBM165933(US10214524, Example 150 | US9067931, 150)
Affinity DataKi:  35nM. Assay description: Rat brain tissue (hippocampus or whole brain) is homogenized in homogenization buffer (10% w/v, 0.32 M sucrose, 1 mM EDTA, 0.1 mM phenylmethylsulphon...
In DepthDetails US Patent
TargetNeuronal acetylcholine receptor subunit alpha-7(Rattus norvegicus (Rat))
Bayer Intellectual Property
US Patent
LigandPNGBDBM165933(US10214524, Example 150 | US9067931, 150)
Affinity DataKi:  35nM ΔG°:  -9.45kcal/molepH: 7.4 T: 2°C. Assay description: The [3H]-methyllycaconitine binding assay is a modification of the method described by Davies et al. in Neuropharmacol. 1999, 38, 679-690.Rat brain t...
In DepthDetails US Patent