BDBM166088 US9067937, 32
SMILES CN(C)[C@H]1CC[C@@H](CC1)Nc1c(cnc2ccc(nc12)-c1cc(F)c(O)c(Cl)c1)S(C)(=O)=O
InChI Key InChIKey=YPWDIJBYLGCHOL-SHTZXODSSA-N
Data  1 IC50
  Tab Delimited (TSV)   2D SDfile   Computed 3D by Vconf -m prep SDfile
Find this compound or compounds like it in BindingDB:
Activity Spreadsheet -- Enzyme Inhibition Constant Data from BindingDB
Found 1 hit for monomerid = 166088
TargetMaternal embryonic leucine zipper kinase(Homo sapiens (Human))
Oncotherapy Science
US Patent
LigandPNGBDBM166088(US9067937, 32)
Affinity DataIC50:  1.60nMpH: 7.4 T: 2°C. Assay description: MELK activity was determined in the presence or absence of compounds using fluorescein isothiocyanate-labeled (FITC-labeled) histone H3 peptide as a ...
In DepthDetails US Patent