BDBM166093 US9067937, 37
SMILES CC(=O)c1cnc2ccc(nc2c1N1CCC(CCN2CCCC2)CC1)-c1cc(F)c(O)c(Cl)c1
InChI Key InChIKey=SRDLLLPPROJEOX-UHFFFAOYSA-N
Data  1 IC50
  Tab Delimited (TSV)   2D SDfile   Computed 3D by Vconf -m prep SDfile
Find this compound or compounds like it in BindingDB:
Activity Spreadsheet -- Enzyme Inhibition Constant Data from BindingDB
Found 1 hit for monomerid = 166093
TargetMaternal embryonic leucine zipper kinase(Homo sapiens (Human))
Oncotherapy Science
US Patent
LigandPNGBDBM166093(US9067937, 37)
Affinity DataIC50:  10nMpH: 7.4 T: 2°C. Assay description: MELK activity was determined in the presence or absence of compounds using fluorescein isothiocyanate-labeled (FITC-labeled) histone H3 peptide as a ...
In DepthDetails US Patent