BDBM166095 US9067937, 39
SMILES CN(C)CCNc1ccc(Nc2c(cnc3ccc(nc23)-c2cc(F)c(O)c(Cl)c2)C(C)=O)cn1
InChI Key InChIKey=OBVDIKLQRBFRGG-UHFFFAOYSA-N
Data  1 IC50
  Tab Delimited (TSV)   2D SDfile   Computed 3D by Vconf -m prep SDfile
Find this compound or compounds like it in BindingDB:
Activity Spreadsheet -- Enzyme Inhibition Constant Data from BindingDB
Found 1 hit for monomerid = 166095
TargetMaternal embryonic leucine zipper kinase(Homo sapiens (Human))
Oncotherapy Science
US Patent
LigandPNGBDBM166095(US9067937, 39)
Affinity DataIC50:  30nMpH: 7.4 T: 2°C. Assay description: MELK activity was determined in the presence or absence of compounds using fluorescein isothiocyanate-labeled (FITC-labeled) histone H3 peptide as a ...
In DepthDetails US Patent