BDBM166142 US9067937, 86
SMILES CN(C)C[C@H]1CC[C@@H](CC1)Nc1c(cnc2ccc(nc12)-c1ccc(O)nc1)C(C)=O
InChI Key InChIKey=FOWKEIIGCPMRJE-SAABIXHNSA-N
Data  1 IC50
  Tab Delimited (TSV)   2D SDfile   Computed 3D by Vconf -m prep SDfile
Find this compound or compounds like it in BindingDB:
Activity Spreadsheet -- Enzyme Inhibition Constant Data from BindingDB
Found 1 hit for monomerid = 166142
TargetMaternal embryonic leucine zipper kinase(Homo sapiens (Human))
Oncotherapy Science
US Patent
LigandPNGBDBM166142(US9067937, 86)
Affinity DataIC50:  11nMpH: 7.4 T: 2°C. Assay description: MELK activity was determined in the presence or absence of compounds using fluorescein isothiocyanate-labeled (FITC-labeled) histone H3 peptide as a ...
In DepthDetails US Patent