BDBM16635 6-[(3,5-dimethyl-1-benzofuran-2-)sulfonyl]-2,3-dihydropyridazin-3-one::Heterocyclic Sulfonylpyridazinone, 19q
SMILES Cc1c(oc2ccc(C)cc12)S(=O)(=O)c1ccc(=O)[nH]n1
InChI Key InChIKey=NTJWJLZMOKBOFA-UHFFFAOYSA-N
Data  1 IC50
  Tab Delimited (TSV)   2D SDfile   Computed 3D by Vconf -m prep SDfile
Find this compound or compounds like it in BindingDB:
Activity Spreadsheet -- Enzyme Inhibition Constant Data from BindingDB
Found 1 hit for monomerid = 16635
TargetAldo-keto reductase family 1 member B1(Homo sapiens (Human))
Pfizer
LigandPNGBDBM16635(6-[(3,5-dimethyl-1-benzofuran-2-)sulfonyl]-2,3-dih...)
Affinity DataIC50:  13nM. Assay description: The activity of the enzyme was determined spectrophotometrically by monitoring the change in absorbance at 340 nm, which is due to the disappearance ...
In DepthDetails ArticlePubMed