BDBM16650 N-(4-sulfamoylphenyl)hexanamide::aromatic sulfonamide compound 15
SMILES CCCCCC(=O)Nc1ccc(cc1)S(N)(=O)=O
InChI Key InChIKey=YSXLMBQOWQEROH-UHFFFAOYSA-N
Data  4 KI
  Tab Delimited (TSV)   2D SDfile   Computed 3D by Vconf -m prep SDfile
Find this compound or compounds like it in BindingDB:
Activity Spreadsheet -- Enzyme Inhibition Constant Data from BindingDB
Found 4 hits for monomerid = 16650
TargetCarbonic anhydrase 5A, mitochondrial(Mus musculus (mouse))
Universita Degli Studi Di Firenze
LigandPNGBDBM16650(N-(4-sulfamoylphenyl)hexanamide | aromatic sulfona...)
Affinity DataKi:  18nM. Assay description: An Applied Photophysics stopped-flow instrument has been used for assaying the CA-catalyzed CO2 hydration activity. Phenol red has been used as indic...
In DepthDetails ArticlePubMed
TargetCarbonic anhydrase 2(Homo sapiens (Human))
Universita Degli Studi Di Firenze
LigandPNGBDBM16650(N-(4-sulfamoylphenyl)hexanamide | aromatic sulfona...)
Affinity DataKi:  63nM. Assay description: Initial rates of 4-nitrophenyl acetate hydrolysis catalyzed by different CA isozymes were monitored spectrophotometrically at 400 nm. A molar absorpt...
In DepthDetails ArticlePubMed
TargetCarbonic anhydrase 4(Bos taurus (bovine))
Universita Degli Studi Di Firenze
LigandPNGBDBM16650(N-(4-sulfamoylphenyl)hexanamide | aromatic sulfona...)
Affinity DataKi:  980nM. Assay description: Initial rates of 4-nitrophenyl acetate hydrolysis catalyzed by different CA isozymes were monitored spectrophotometrically at 400 nm. A molar absorpt...
In DepthDetails ArticlePubMed
TargetCarbonic anhydrase 1(Homo sapiens (Human))
Universita Degli Studi Di Firenze
LigandPNGBDBM16650(N-(4-sulfamoylphenyl)hexanamide | aromatic sulfona...)
Affinity DataKi:  1.42E+4nM ΔG°:  -6.61kcal/molepH: 7.4 T: 2°C. Assay description: Initial rates of 4-nitrophenyl acetate hydrolysis catalyzed by different CA isozymes were monitored spectrophotometrically at 400 nm. A molar absorpt...
In DepthDetails ArticlePubMed