BDBM167049 US9073876, 135::US9732093, Compound 135
SMILES CC(C)c1nccc(Oc2c(F)c(ccc2C2CCC2)-c2cnc(N)cn2)n1
InChI Key InChIKey=JWFRFJWVMZRXPV-UHFFFAOYSA-N
Data  3 KI
  Tab Delimited (TSV)   2D SDfile   Computed 3D by Vconf -m prep SDfile
Find this compound or compounds like it in BindingDB:
Activity Spreadsheet -- Enzyme Inhibition Constant Data from BindingDB
Found 3 hits for monomerid = 167049
TargetArachidonate 5-lipoxygenase-activating protein(Homo sapiens (Human))
Janssen Pharmaceutica
US Patent
LigandPNGBDBM167049(US9073876, 135 | US9732093, Compound 135)
Affinity DataKi:  1.30nM. Assay description: The assay below is used to test the modulatory activity of compounds against FLAP. Human and mouse FLAP-encoding DNA was amplified by polymerase chai...
In DepthDetails US Patent
TargetFlap endonuclease 1(Homo sapiens (Human))
Janssen Pharmaceutica
US Patent
LigandPNGBDBM167049(US9073876, 135 | US9732093, Compound 135)
Affinity DataKi:  1.30nM. Assay description: The assay below is used to test the modulatory activity of compounds against FLAP. Human and mouse FLAP-encoding DNA was amplified by polymerase chai...
In DepthDetails US Patent
TargetFlap endonuclease 1(Homo sapiens (Human))
Janssen Pharmaceutica
US Patent
LigandPNGBDBM167049(US9073876, 135 | US9732093, Compound 135)
Affinity DataKi:  1.30nM. Assay description: The assay below is used to test the modulatory activity of compounds against FLAP. Human and mouse FLAP-encoding DNA was amplified by polymerase chai...
In DepthDetails US Patent