BDBM167063 US9073876, 149
SMILES CC(C)(C)OC(=O)NCCNc1ccnc(Oc2c(F)c(ccc2C2CCC2)-c2cnc(N)cn2)n1
InChI Key InChIKey=KTZRYRQPVGLVKC-UHFFFAOYSA-N
Data  1 KI
  Tab Delimited (TSV)   2D SDfile   Computed 3D by Vconf -m prep SDfile
Find this compound or compounds like it in BindingDB:
Activity Spreadsheet -- Enzyme Inhibition Constant Data from BindingDB
Found 1 hit for monomerid = 167063
TargetArachidonate 5-lipoxygenase-activating protein(Homo sapiens (Human))
Janssen Pharmaceutica
US Patent
LigandPNGBDBM167063(US9073876, 149)
Affinity DataKi:  1.30nM. Assay description: The assay below is used to test the modulatory activity of compounds against FLAP. Human and mouse FLAP-encoding DNA was amplified by polymerase chai...
Ligand InfoPC cidPC sid
In DepthDetails US Patent