BDBM16726 CHEMBL203120::N-[5-bromo-2-(piperazin-1-yl)phenyl]naphthalene-1-carboxamide::Naphthyl Compound, 3d
SMILES Brc1ccc(N2CCNCC2)c(NC(=O)c2cccc3ccccc23)c1
InChI Key InChIKey=SWKYODCETJXWLS-UHFFFAOYSA-N
Data  3 IC50
  Tab Delimited (TSV)   2D SDfile   Computed 3D by Vconf -m prep SDfile
Find this compound or compounds like it in BindingDB:
Activity Spreadsheet -- Enzyme Inhibition Constant Data from BindingDB
Found 3 hits for monomerid = 16726
TargetBeta-secretase 1(Homo sapiens (Human))
Universite De La Mediterranee
LigandPNGBDBM16726(CHEMBL203120 | N-[5-bromo-2-(piperazin-1-yl)phenyl...)
Affinity DataIC50:  1.00E+3nMpH: 7.5 T: 2°C. Assay description: These experiments have been preformed using BACE-1 FRET assay kit (PanVera Corporation, Madison, WI), using a multiwell spectrofluorometer instrument...
In DepthDetails ArticlePubMed
TargetBeta-secretase 1(Homo sapiens (Human))
Universite De La Mediterranee
LigandPNGBDBM16726(CHEMBL203120 | N-[5-bromo-2-(piperazin-1-yl)phenyl...)
Affinity DataIC50:  1.00E+3nM. Assay description: Inhibition of BACE1 after 2 hrs by FRET assay
In DepthDetails ArticlePubMed
TargetBeta-secretase 1(Homo sapiens (Human))
Universite De La Mediterranee
LigandPNGBDBM16726(CHEMBL203120 | N-[5-bromo-2-(piperazin-1-yl)phenyl...)
Affinity DataIC50:  1.00E+3nM. Assay description: Inhibition of BACE1 activity by FRET assay
In DepthDetails ArticlePubMed