BDBM167416 US9073893, 9
SMILES Cn1n(C2CCNCC2)c(=O)c2c(cccc12)C(N)=O
InChI Key InChIKey=XCMZWTDSYWVLET-UHFFFAOYSA-N
Data  1 IC50  2 Kd
  Tab Delimited (TSV)   2D SDfile   Computed 3D by Vconf -m prep SDfile
Find this compound or compounds like it in BindingDB:
Activity Spreadsheet -- Enzyme Inhibition Constant Data from BindingDB
Found 3 hits for monomerid = 167416
TargetPoly [ADP-ribose] polymerase 1(Homo sapiens (Human))
Nerviano Medical Sciences
US Patent
LigandPNGBDBM167416(US9073893, 9)
Affinity DataKd:  14nM. Assay description: Affinity evaluation of the tested compounds and their selectivity with respect to the different PARP isoforms of interest was assessed in a displacem...
In DepthDetails US Patent
TargetPoly [ADP-ribose] polymerase 1(Homo sapiens (Human))
Nerviano Medical Sciences
US Patent
LigandPNGBDBM167416(US9073893, 9)
Affinity DataIC50:  50nMT: 2°C. Assay description: Cellular activity of PARP-1 inhibitors was assessed by measuring the inhibition of the hydrogen peroxide induced PAR formation in HeLa cells (ECACC)....
In DepthDetails US Patent
TargetPoly [ADP-ribose] polymerase 2(Homo sapiens (Human))
Nerviano Medical Sciences
US Patent
LigandPNGBDBM167416(US9073893, 9)
Affinity DataKd:  140nM. Assay description: Affinity evaluation of the tested compounds and their selectivity with respect to the different PARP isoforms of interest was assessed in a displacem...
In DepthDetails US Patent