BDBM167434 US9073906, 44
SMILES NC(=O)C12CC3CC(C1)C(NC(=O)CN1CCCN(c4ccc(F)cc4)S1(=O)=O)C(C3)C2
InChI Key InChIKey=IYLBQFGHHLIWRY-UHFFFAOYSA-N
Data  2 IC50
  Tab Delimited (TSV)   2D SDfile   Computed 3D by Vconf -m prep SDfile
Find this compound or compounds like it in BindingDB:
Activity Spreadsheet -- Enzyme Inhibition Constant Data from BindingDB
Found 2 hits for monomerid = 167434
Target11-beta-hydroxysteroid dehydrogenase type 2(Homo sapiens (Human))
Korea Research Institute Of Chemical Technology
US Patent
LigandPNGBDBM167434(US9073906, 44)
Affinity DataIC50: >1.00E+4nM. Assay description: The in vitro inhibitory activities of the novel compounds to human 11β-HSD1 were evaluated in accordance with homogenous time-resolved fluoresce...
In DepthDetails US Patent
Target11-beta-hydroxysteroid dehydrogenase 1(Homo sapiens (Human))
Korea Research Institute Of Chemical Technology
US Patent
LigandPNGBDBM167434(US9073906, 44)
Affinity DataIC50:  79nM. Assay description: The in vitro inhibitory activities of the novel compounds to human 11β-HSD1 were evaluated in accordance with homogenous time-resolved fluoresce...
In DepthDetails US Patent