BDBM167993 US9073926, 27
SMILES O=C(Nc1cccnc1)c1ccc2cc3C(=O)NCCCn3c2n1
InChI Key InChIKey=ZBPWYWRJCWAYEQ-UHFFFAOYSA-N
Data  1 IC50
  Tab Delimited (TSV)   2D SDfile   Computed 3D by Vconf -m prep SDfile
Find this compound or compounds like it in BindingDB:
Activity Spreadsheet -- Enzyme Inhibition Constant Data from BindingDB
Found 1 hit for monomerid = 167993
TargetRibosomal protein S6 kinase alpha-3(Homo sapiens (Human))
Boehringer Ingelheim International
US Patent
LigandPNGBDBM167993(US9073926, 27)
Affinity DataIC50:  37nMpH: 7.5Assay Description:Human RSK2 protein, purchased from Invitrogen, is used to measure kinase activity utilizing Kinase Glo Plus (Promega) a homogeneous assay technology,...
In DepthDetails US Patent