BDBM167995 US9073926, 29
SMILES CC(C)n1ncc2cc(NC(=O)c3ccc4cc5C(=O)NCCC(C)n5c4n3)cnc12
InChI Key InChIKey=YBDVSJKTAWTRHQ-UHFFFAOYSA-N
Data  1 IC50
  Tab Delimited (TSV)   2D SDfile   Computed 3D by Vconf -m prep SDfile
Find this compound or compounds like it in BindingDB:
Activity Spreadsheet -- Enzyme Inhibition Constant Data from BindingDB
Found 1 hit for monomerid = 167995
TargetRibosomal protein S6 kinase alpha-3(Homo sapiens (Human))
Boehringer Ingelheim International
US Patent
LigandPNGBDBM167995(US9073926, 29)
Affinity DataIC50:  2.10nMpH: 7.5Assay Description:Human RSK2 protein, purchased from Invitrogen, is used to measure kinase activity utilizing Kinase Glo Plus (Promega) a homogeneous assay technology,...
In DepthDetails US Patent