BDBM168021 US9073926, 55
SMILES CCn1c(NC(=O)c2ccc3cc4C(=O)NCCCn4c3n2)nc2ccccc12
InChI Key InChIKey=HNSNQBPXQBNWAY-UHFFFAOYSA-N
Data  1 IC50
  Tab Delimited (TSV)   2D SDfile   Computed 3D by Vconf -m prep SDfile
Find this compound or compounds like it in BindingDB:
Activity Spreadsheet -- Enzyme Inhibition Constant Data from BindingDB
Found 1 hit for monomerid = 168021
TargetRibosomal protein S6 kinase alpha-3(Homo sapiens (Human))
Boehringer Ingelheim International
US Patent
LigandPNGBDBM168021(US9073926, 55)
Affinity DataIC50:  140nMpH: 7.5Assay Description:Human RSK2 protein, purchased from Invitrogen, is used to measure kinase activity utilizing Kinase Glo Plus (Promega) a homogeneous assay technology,...
In DepthDetails US Patent