BDBM168086 US9073931, E9b
SMILES CCC(=O)c1cnc(nc1C(F)(F)F)N1CCn2c(nc3cc(CO)c(cc23)S(C)(=O)=O)[C@@H]1C(C)C
InChI Key InChIKey=HLMVLEINLZPXPH-IBGZPJMESA-N
Data  2 KI
  Tab Delimited (TSV)   2D SDfile   Computed 3D by Vconf -m prep SDfile
Find this compound or compounds like it in BindingDB:
Activity Spreadsheet -- Enzyme Inhibition Constant Data from BindingDB
Found 2 hits for monomerid = 168086
TargetOxysterols receptor LXR-beta(Homo sapiens (Human))
Vitae Pharmaceuticals
US Patent
LigandPNGBDBM168086(US9073931, E9b)
Affinity DataKi:  1.36E+3nM ΔG°:  -8.00kcal/moleT: 2°C. Assay description: Compounds of the invention were assessed in a competition binding assay where different concentrations of compounds were incubated with the LXR ligan...
In DepthDetails US Patent
TargetOxysterols receptor LXR-alpha(Homo sapiens (Human))
Vitae Pharmaceuticals
US Patent
LigandPNGBDBM168086(US9073931, E9b)
Affinity DataKi: >3.33E+3nM ΔG°: >-7.47kcal/moleT: 2°C. Assay description: Compounds of the invention were assessed in a competition binding assay where different concentrations of compounds were incubated with the LXR ligan...
In DepthDetails US Patent