BDBM16817 (2S)-2-[(2,6-dichlorophenyl)formamido]-3-{4-[5-(2-hydroxyethoxy)-2-methyl-3-oxo-2,3-dihydropyridazin-4-yl]phenyl}propanoic acid::pyridazinone-based antagonist, 19
SMILES Cn1ncc(OCCO)c(-c2ccc(C[C@H](NC(=O)c3c(Cl)cccc3Cl)C(O)=O)cc2)c1=O
InChI Key InChIKey=SDQKXZWRNGVHOC-KRWDZBQOSA-N
Data  2 IC50
  Tab Delimited (TSV)   2D SDfile   Computed 3D by Vconf -m prep SDfile
Find this compound or compounds like it in BindingDB:
Activity Spreadsheet -- Enzyme Inhibition Constant Data from BindingDB
Found 2 hits for monomerid = 16817
TargetIntegrin alpha-4/beta-7(Homo sapiens (Human))
Johnson & Johnson Pharmaceutical
LigandPNGBDBM16817((2S)-2-[(2,6-dichlorophenyl)formamido]-3-{4-[5-(2-...)
Affinity DataIC50:  2nMT: 2°C. Assay description: M2 anti-FLAG antibody coated 96-well plates were coated with recombinant FLAG-hMAdCAM-1 contained in Dulbecco PBS. The compounds to be tested were ad...
In DepthDetails ArticlePubMed
TargetIntegrin alpha-4/beta-1 [T112H](Homo sapiens (Human))
Johnson & Johnson Pharmaceutical
LigandPNGBDBM16817((2S)-2-[(2,6-dichlorophenyl)formamido]-3-{4-[5-(2-...)
Affinity DataIC50:  300nMpH: 7.4 T: 2°C. Assay description:  Immulon 96-well plates were coated with recombinant hVCAM-1 overnight at 4 C. Plates were washed and blocked for 1 h at room temperature in PBS-BSA....
In DepthDetails ArticlePubMed