BDBM168171 US9688642, 1
SMILES COc1ccc(F)c(c1)-c1ncc(COc2cccc(c2)[C@@H](CC(O)=O)C2CC2)nc1CC(C)(C)C
InChI Key InChIKey=WOLFEJUCBJJIIB-QHCPKHFHSA-N
Data  4 EC50
  Tab Delimited (TSV)   2D SDfile   Computed 3D by Vconf -m prep SDfile
Find this compound or compounds like it in BindingDB:
Activity Spreadsheet -- Enzyme Inhibition Constant Data from BindingDB
Found 4 hits for monomerid = 168171
TargetFree fatty acid receptor 1(Homo sapiens (Human))
Janssen Pharmaceutica
US Patent
LigandPNGBDBM168171(US9688642, 1)
Affinity DataEC50:  2nMT: 2°C. Assay description: Compounds were tested in a calcium flux assay using transfected HEK293 cells stably expressing either human GPR40 or rat GPR40. Human GPR40 expressin...
Ligand InfoPC cidPC sid
In DepthDetails US Patent
TargetFree fatty acid receptor 1(Homo sapiens (Human))
Janssen Pharmaceutica
US Patent
LigandPNGBDBM168171(US9688642, 1)
Affinity DataEC50:  2nM. Assay description: Agonist activity at human GPR40 transfected in HEK293 cells assessed as increase in intracellular calcium level incubated for 1 hr by Fluo-8 dye base...
Ligand InfoPC cidPC sid
In DepthDetails ArticlePubMed
TargetMelanocortin receptor 4(Rattus norvegicus)
Janssen Research & Developmen
Curated by ChEMBL
LigandPNGBDBM168171(US9688642, 1)
Affinity DataEC50:  32nM. Assay description: Agonist activity at rat GPR40 transfected in HEK293 cells assessed as increase in intracellular calcium level incubated for 1 hr by Fluo-8 dye based ...
Ligand InfoPC cidPC sid
In DepthDetails ArticlePubMed
TargetFree fatty acid receptor 1(Rattus norvegicus)
Janssen Pharmaceutica
US Patent
LigandPNGBDBM168171(US9688642, 1)
Affinity DataEC50:  32nMT: 2°C. Assay description: Compounds were tested in a calcium flux assay using transfected HEK293 cells stably expressing either human GPR40 or rat GPR40. Human GPR40 expressin...
Ligand InfoPC cidPC sid
In DepthDetails US Patent