BDBM168261 US9669031, 89 8-chloro-3-(3-chlorophenyl)-3-methyl-6-[[6-(methylamino)pyrimidin-4-yl]amino]-2H-imidazo[1,5-a]pyridine-1,5-dione (Cpd. No. 89)
SMILES CNc1cc(Nc2cc(Cl)c3C(=O)NC(C)(c4cccc(Cl)c4)n3c2=O)ncn1
InChI Key InChIKey=AEOGHGSLKIMNLB-UHFFFAOYSA-N
Data  2 IC50
  Tab Delimited (TSV)   2D SDfile   Computed 3D by Vconf -m prep SDfile
Find this compound or compounds like it in BindingDB:
Activity Spreadsheet -- Enzyme Inhibition Constant Data from BindingDB
Found 2 hits for monomerid = 168261
TargetMAP kinase-interacting serine/threonine-protein kinase 2(Homo sapiens (Human))
Effector Therapeutics
US Patent
LigandPNGBDBM168261(US9669031, 89 8-chloro-3-(3-chlorophenyl)-3-methyl...)
Affinity DataIC50: <10nMT: 2°C. Assay description: Compounds are screened for Mnk inhibition using the ADP-Glo kinase assay kit (Promega, catalogue No. V9101). All kinase reactions are performed in Re...
Ligand InfoPC cidPC sid
In DepthDetails US Patent
TargetMAP kinase-interacting serine/threonine-protein kinase 1(Homo sapiens (Human))
Effector Therapeutics
US Patent
LigandPNGBDBM168261(US9669031, 89 8-chloro-3-(3-chlorophenyl)-3-methyl...)
Affinity DataIC50: <10nMT: 2°C. Assay description: Compounds are screened for Mnk inhibition using the ADP-Glo kinase assay kit (Promega, catalogue No. V9101). All kinase reactions are performed in Re...
Ligand InfoPC cidPC sid
In DepthDetails US Patent