BDBM168434 US9675571, 118
SMILES CC(C)CN(CC(C)C)c1ccc(cc1NC(=O)Cc1ccc(C)nc1)[C@H]1C[C@H]1C(O)=O
InChI Key InChIKey=AGMWKYSIXBRAKQ-FGZHOGPDSA-N
Data  1 EC50
  Tab Delimited (TSV)   2D SDfile   Computed 3D by Vconf -m prep SDfile
Find this compound or compounds like it in BindingDB:
Activity Spreadsheet -- Enzyme Inhibition Constant Data from BindingDB
Found 1 hit for monomerid = 168434
TargetIndoleamine 2,3-dioxygenase 1(Homo sapiens (Human))
SRMLSC
US Patent
LigandPNGBDBM168434(US9675571, 118)
Affinity DataEC50:  126nMT: 2°C. Assay description: Human IDO1/HEK293 cells were seeded at 10,000 cells per 50 uL per well with RPMI/phenol red free media contains 10% FBS in a 384-well black wall clea...
Ligand InfoPC cidPC sid
In DepthDetails US Patent