BDBM16978 6-{5-[(2S)-2-amino-3-(1H-indol-3-yl)propoxy]pyridin-3-yl}isoquinolin-3-amine::Isoquinoline-pyridine, 10y
SMILES N[C@H](COc1cncc(c1)-c1ccc2cnc(N)cc2c1)Cc1c[nH]c2ccccc12
InChI Key InChIKey=OARXLGLBMAHALM-NRFANRHFSA-N
Data  7 IC50
  Tab Delimited (TSV)   2D SDfile   Computed 3D by Vconf -m prep SDfile
Find this compound or compounds like it in BindingDB:
Activity Spreadsheet -- Enzyme Inhibition Constant Data from BindingDB
Found 7 hits for monomerid = 16978
LigandPNGBDBM16978(6-{5-[(2S)-2-amino-3-(1H-indol-3-yl)propoxy]pyridi...)
Affinity DataIC50:  3.40nM. Assay description: The kinase assay uses His-Akt1 and a biotinylated peptide as substrate. The biotinylated peptides were immobilized on streptavidin-coated FLASH plat...
In DepthDetails ArticlePubMed
TargetRAC-beta serine/threonine-protein kinase(Homo sapiens (Human))
Abbott Laboratories
LigandPNGBDBM16978(6-{5-[(2S)-2-amino-3-(1H-indol-3-yl)propoxy]pyridi...)
Affinity DataIC50:  21nM. Assay description: The kinase assay uses His-Akt1 and a biotinylated peptide as substrate. The biotinylated peptides were immobilized on streptavidin-coated FLASH plat...
In DepthDetails ArticlePubMed
TargetRAC-gamma serine/threonine-protein kinase(Homo sapiens (Human))
Abbott Laboratories
LigandPNGBDBM16978(6-{5-[(2S)-2-amino-3-(1H-indol-3-yl)propoxy]pyridi...)
Affinity DataIC50:  76nM. Assay description: The kinase assay uses His-Akt1 and a biotinylated peptide as substrate. The biotinylated peptides were immobilized on streptavidin-coated FLASH plat...
In DepthDetails ArticlePubMed
TargetRAC-alpha serine/threonine-protein kinase(Homo sapiens (Human))
Zhejiang University
Curated by ChEMBL
LigandPNGBDBM16978(6-{5-[(2S)-2-amino-3-(1H-indol-3-yl)propoxy]pyridi...)
Affinity DataIC50:  3.40nM. Assay description: Inhibition of Akt
In DepthDetails ArticlePubMed
TargetProtein kinase C gamma type(Homo sapiens (Human))
Abbott Laboratories
LigandPNGBDBM16978(6-{5-[(2S)-2-amino-3-(1H-indol-3-yl)propoxy]pyridi...)
Affinity DataIC50:  31nM. Assay description: The kinase assay uses purified recombinant enzyme and a biotinylated peptide as substrate. The biotinylated peptides were immobilized on streptavidi...
In DepthDetails ArticlePubMed
TargetProtein kinase C zeta type(Homo sapiens (Human))
Abbott Laboratories
LigandPNGBDBM16978(6-{5-[(2S)-2-amino-3-(1H-indol-3-yl)propoxy]pyridi...)
Affinity DataIC50:  8.30E+3nM. Assay description: The kinase assay uses purified recombinant enzyme and a biotinylated peptide as substrate. The biotinylated peptides were immobilized on streptavidi...
In DepthDetails ArticlePubMed
TargetcAMP-dependent protein kinase catalytic subunit alpha(Bos taurus (bovine))
Abbott Laboratories
LigandPNGBDBM16978(6-{5-[(2S)-2-amino-3-(1H-indol-3-yl)propoxy]pyridi...)
Affinity DataIC50:  8nM. Assay description: The kinase assay uses purified recombinant enzyme and a biotinylated peptide as substrate. The biotinylated peptides were immobilized on streptavidi...
In DepthDetails ArticlePubMed