BDBM16990 5-{[(3Z)-5-(carbamoylamino)-2-oxo-2,3-dihydro-1H-indol-3-ylidene]methyl}-N-[2-(1H-imidazol-5-yl)ethyl]-1H-pyrrole-3-carboxamide::Indolinone based compound, 3e
SMILES NC(=O)Nc1ccc2NC(=O)C(=Cc3cc(c[nH]3)C(=O)NCCc3cnc[nH]3)c2c1
InChI Key InChIKey=OEVLFLMMFGQZDL-UHFFFAOYSA-N
Data  1 IC50
  Tab Delimited (TSV)   2D SDfile   Computed 3D by Vconf -m prep SDfile
Find this compound or compounds like it in BindingDB:
Activity Spreadsheet -- Enzyme Inhibition Constant Data from BindingDB
Found 1 hit for monomerid = 16990
Target3-phosphoinositide-dependent protein kinase 1(Homo sapiens (Human))
Berlex Biosciences
LigandPNGBDBM16990(5-{[(3Z)-5-(carbamoylamino)-2-oxo-2,3-dihydro-1H-i...)
Affinity DataIC50:  14nMpH: 7.2 T: 2°C. Assay description: The coupled assay can detect inhibitors of AKT2 activation, as well as direct inhibitors of PDK1 or AKT2. Inactive AKT2 is activated in situ by incub...
In DepthDetails ArticlePubMed