BDBM17005 Indolinone based compound, 13::[(3Z)-3-{1-[4-(aminomethyl)-1H-pyrrol-2-yl]ethylidene}-2-oxo-2,3-dihydro-1H-indol-5-yl]urea
SMILES C\C(=C1\C(=O)Nc2ccc(NC(N)=O)cc12)c1cc(CN)c[nH]1
InChI Key InChIKey=DUCXJHSBLDKCIK-ZSOIEALJSA-N
Data  1 IC50
  Tab Delimited (TSV)   2D SDfile   Computed 3D by Vconf -m prep SDfile
Find this compound or compounds like it in BindingDB:
Activity Spreadsheet -- Enzyme Inhibition Constant Data from BindingDB
Found 1 hit for monomerid = 17005
Target3-phosphoinositide-dependent protein kinase 1(Homo sapiens (Human))
Berlex Biosciences
LigandPNGBDBM17005(Indolinone based compound, 13 | [(3Z)-3-{1-[4-(ami...)
Affinity DataIC50:  10nM. Assay description: The coupled assay can detect inhibitors of AKT2 activation, as well as direct inhibitors of PDK1 or AKT2. Inactive AKT2 is activated in situ by incub...
In DepthDetails ArticlePubMed